***2021-03-15 00:15:16
***ß_601Â***
*Node, NSET=Nall
****vf^Cv113****
** Volume elements
*Element, TYPE=C3D15, ELSET=EvolumesC3D15R
***«Eß_Ýè***
*****Group_1
*NSET,NSET=NodeBC_Group_1
*****Group_2
*NSET,NSET=NodeBC_Group_2
*****Group_3
*NSET,NSET=NodeBC_Group_3
*****Group_4
*NSET,NSET=NodeBC_Group_4
*******[ÈºeLXgC³ÉÄ]
**,Define,element,set,Eall@EEEvfZbg
*ELSET,ELSET=Eall
EvolumesC3D15R
*******,SolidMaterial@EEEÞ¿¨«
*MATERIAL,NAME=SolidMaterial
*ELASTIC
206000,0.300
*******(vfZbgÆÞ¿ÌÖAt¯)
*SOLID SECTION,ELSET=Eall,MATERIAL=SolidMaterial
*******(WuÌÝèj
*STEP
*STATIC
*******«Eð
*BOUNDARY
NodeBC_Group_1,1,1
NodeBC_Group_2,1,1
NodeBC_Group_2,3,3
NodeBC_Group_3,1,3
NodeBC_Group_4,3,3,-1.94
**NodeBC_Group_5,3,3,-1.94
***CLOAD
**96,3,-100
**196,3,-200
**206,3,-200
**216,3,-200
**226,3,-200
**236,3,-100
*******oÍÝè
*NODE FILE
U
*EL FILE
S,E
*END STEP