** written by FreeCAD inp file writer for CalculiX,Abaqus meshes
** highest dimension mesh elements only.
** Nodes
*Node, NSET=Nall
*NSET,NSET=N1
** Volume elements
*Element, TYPE=C3D10, ELSET=Evolumes
** Define element set Eall
*ELSET, ELSET=Eall
Evolumes
*ELEMENT, TYPE=GAPUNI, ELSET=G1
***********************************************************
** Element sets for materials and FEM element type (solid, shell, beam, fluid)
** written by write_element_sets_material_and_femelement_type function
*ELSET,ELSET=SolidMaterialSolid
*ELSET,ELSET=SolidMaterial001Solid
***********************************************************
** Node sets for prescribed displacement constraint
** written by write_node_sets_constraints_displacement function
** FemConstraintDisplacement
*NSET,NSET=FemConstraintDisplacement
** FemConstraintDisplacement001
*NSET,NSET=FemConstraintDisplacement001
** FemConstraintDisplacement002
*NSET,NSET=FemConstraintDisplacement002
** FemConstraintDisplacement003
*NSET,NSET=FemConstraintDisplacement003
*NSET,NSET=FemConstraintDisplacement004
***********************************************************
** Surfaces for contact constraint
** written by write_surfaces_contraints_contact function
** FemConstraintContact
*SURFACE, NAME =DEP1
278,S3
281,S2
283,S3
284,S4
285,S3
286,S1
287,S2
299,S1
*SURFACE, NAME =IND1
196,S3
198,S1
199,S4
200,S2
204,S3
208,S3
213,S4
218,S1
220,S3
224,S3
225,S1
226,S1
232,S3
235,S3
239,S1
245,S4
248,S1
254,S2
258,S2
259,S3
** ... 5 like lines cut
***********************************************************
** Materials
** written by write_materials function
** Young's modulus unit is MPa = N/mm2
** FreeCAD material name: CalculiX-Steel
** SolidMaterial
*MATERIAL, NAME=SolidMaterial
*ELASTIC
210000, 0.300
** FreeCAD material name: Empty
** SolidMaterial001
*MATERIAL, NAME=SolidMaterial001
*ELASTIC
10, 0.490
***********************************************************
** Sections
** written by write_femelementsets function
*SOLID SECTION, ELSET=SolidMaterialSolid, MATERIAL=SolidMaterial
*SOLID SECTION, ELSET=SolidMaterial001Solid, MATERIAL=SolidMaterial001
***********************************************************
** Contact Constraints
** written by write_constraints_contact function
** FemConstraintContact
*CONTACT PAIR, INTERACTION=INT1,TYPE=SURFACE TO SURFACE
DEP1,IND1
*SURFACE INTERACTION, NAME=INT1
*SURFACE BEHAVIOR,PRESSURE-OVERCLOSURE=LINEAR
1000000.0
*RIGID BODY,ELSET=SolidMaterial001Solid,REF NODE=1000,ROT NODE=1001
*GAP,ELSET=G1
0.0,0.,0.,1.
***********************************************************
** At least one step is needed to run an CalculiX analysis of FreeCAD
** written by write_step_begin function
*STEP
*STATIC
***********************************************************
** Displacement constraint applied
** written by write_constraints_displacement function
** FemConstraintDisplacement
*BOUNDARY
FemConstraintDisplacement,1
** FemConstraintDisplacement001
*BOUNDARY
FemConstraintDisplacement001,3
** FemConstraintDisplacement002
*BOUNDARY
FemConstraintDisplacement002,2
** FemConstraintDisplacement003
*BOUNDARY
FemConstraintDisplacement003,1
FemConstraintDisplacement003,2
FemConstraintDisplacement003,3,3,-6.9
FemConstraintDisplacement004,1
FemConstraintDisplacement004,2
FemConstraintDisplacement004,3
***********************************************************
** Outputs --> frd file
** written by write_outputs_types function
*NODE FILE
U
*EL FILE
S, E
*NODE PRINT,NSET=N1
U
S
***********************************************************
** written by write_step_end function
*END STEP
***********************************************************
** CalculiX Input file
** written by write_footer function
**   written by    --> FreeCAD 0.18.4 (GitTag)
**   written on    --> Fri Jul 03 11:06:29 2020
**   file name     --> beam_rigid.FCStd
**   analysis name --> Analysis
**
**
**
**   Units
**
**   Geometry (mesh data)        --> mm
**   Materials (Young's modulus) --> N/mm2 = MPa
**   Loads (nodal loads)         --> N
**