** written by FreeCAD inp file writer for CalculiX,Abaqus meshes
** highest dimension mesh elements only.
** Nodes
*Node, NSET=Nall
** Edge elements
*Element, TYPE=B32R, ELSET=Eedges
*Element, TYPE=B31R, ELSET=Eedges2
** Define element set Eall
*ELSET, ELSET=Eall
Eedges
Eedges2
***********************************************************
** Element sets for materials and FEM element type (solid, shell, beam, fluid)
** written by write_element_sets_material_and_femelement_type function
*ELSET,ELSET=M0B0RstdD0
***********************************************************
** Node sets for prescribed displacement constraint
** written by write_node_sets_constraints_displacement function
** FemConstraintDisplacement
*NSET,NSET=FemConstraintDisplacement
***********************************************************
** Materials
** written by write_materials function
** Young's modulus unit is MPa = N/mm2
** FreeCAD material name: CalculiX-Steel
** SolidMaterial
*MATERIAL, NAME=SolidMaterial
*ELASTIC
210000, 0.300
***********************************************************
** Sections
** written by write_femelementsets function
*BEAM SECTION, ELSET=M0B0RstdD0, MATERIAL=SolidMaterial, SECTION=RECT
10 , 10
0.0, 1.0, 0
***********************************************************
** At least one step is needed to run an CalculiX analysis of FreeCAD
** written by write_step_begin function
*STEP
*STATIC
***********************************************************
** Displacement constraint applied
** written by write_constraints_displacement function
** FemConstraintDisplacement
*BOUNDARY
FemConstraintDisplacement,1
FemConstraintDisplacement,2
FemConstraintDisplacement,3
FemConstraintDisplacement,5
FemConstraintDisplacement,4
FemConstraintDisplacement,6
***********************************************************
** Node loads Constraints
** written by write_constraints_force function
*CLOAD
** FemConstraintForce
** node load on shape: Edge:Vertex1
12,1,1.0000000000000E+03
***********************************************************
** Outputs --> frd file
** written by write_outputs_types function
*NODE FILE, OUTPUT=3d
U
*EL FILE
S, E
***********************************************************
** written by write_step_end function
*END STEP
***********************************************************
** CalculiX Input file
** written by write_footer function
**   written by    --> FreeCAD 0.18.4 (GitTag)
**   written on    --> Tue Jul 14 13:24:11 2020
**   file name     --> beam_bar_r.FCStd
**   analysis name --> Analysis
**
**
**
**   Units
**
**   Geometry (mesh data)        --> mm
**   Materials (Young's modulus) --> N/mm2 = MPa
**   Loads (nodal loads)         --> N
**