**vfðè`µÄ ét@CðÇÝÝÜ·B
*INCLUDE,INPUT=T225_Mesh_1.inp
*INCLUDE,INPUT=T225_Mesh_2.inp
*INCLUDE,INPUT=T225_Mesh_3.inp
**·×ÄÌvfðZbgEallÉo^µÜ·B
** Define element set Eall
*ELSET, ELSET=Eall
EvolumesC3D10
EvolumesC3D10_2
EvolumesC3D10_3
**·×ÄÌvfðZbgMaterialSolidSolidÉo^µÜ·B
*ELSET,ELSET=MaterialSolidSolid
EvolumesC3D10
EvolumesC3D10_2
EvolumesC3D10_3
**·×ÄÌß_ðZbgNallÉo^µÜ·B
*NSET,NSET=Nall
Nall_1
Nall_2
Nall_3
** MaterialSolid (mm ton)
*MATERIAL, NAME=MaterialSolid
*ELASTIC
210000, 0.300
*SOLID SECTION, ELSET=Eall, MATERIAL=MaterialSolid
*CONTACT PAIR, INTERACTION=INT1,TYPE=SURFACE TO SURFACE
DEP1,IND1
*SURFACE INTERACTION, NAME=INT1
*SURFACE BEHAVIOR,PRESSURE-OVERCLOSURE=LINEAR
1000000.0
*FRICTION
0.2,5000.
*CONTACT PAIR, INTERACTION=INT2,TYPE=SURFACE TO SURFACE
DEP1,IND2
*SURFACE INTERACTION, NAME=INT2
*SURFACE BEHAVIOR,PRESSURE-OVERCLOSURE=LINEAR
1000000.0
*FRICTION
0.4,5000.
*AMPLITUDE,NAME=Graph1
0,0,
1,1,
2,1,
*AMPLITUDE,NAME=Graph2
0,0,
1,0,
2,1,
*STEP,INC=10000
*STATIC,direct
0.1,2
*BOUNDARY
NodeBC_Group_1,2,2
NodeBC_Group_1_2,2,2
NodeBC_Group_2,1,3
*CLOAD,AMPLITUDE=Graph1
416,3,-1.0
418,3,-1.0
420,3,-1.0
421,3,-1.0
424,3,-1.0
425,3,-1.0
426,3,-1.0
427,3,-1.0
*BOUNDARY,AMPLITUDE=Graph2
NodeBC_Group_1,1,1,1.0
NodeBC_Group_1_2,1,1,1.0
*NODE FILE
U
*EL FILE
S, E
***NODE FILE
***NT
*NODE PRINT, NSET=NodeBC_Group_1, TOTALS=ONLY
 RF
*NODE PRINT, NSET=NodeBC_Group_1_2, TOTALS=ONLY
 RF
*NODE PRINT, NSET=NodeBC_Group_2, TOTALS=ONLY
 RF
*END STEP