**
*NODE,NSET=Nall
*ELEMENT,TYPE=T3D3,ELSET=EAll
*BOUNDARY
1,1,3
21,1,3
**21,3,3
***Nall,2,2
*MATERIAL,NAME=ALUM
*ELASTIC
210000,.3
*DENSITY
7.9e-9
*SOLID SECTION,ELSET=EAll,MATERIAL=ALUM
100.0
*AMPLITUDE,NAME=Graph1
0,0,
1.0,1,
10.0,1,
*STEP,NLGEOM,inc=100000
*DYNAMIC
0.01,3.0
***DAMPING,ALPHA=0.1999,BETA=0.0001
***CONTROLS,PARAMETERS=TIME INCREMENTATION
***30,30,9,100,30,10,,5,,,
***.25,.5,.75,.85,,,1.5,,
*CLOAD,AMPLITUDE=graph1
11,3,-1.0000000000000E+03
*NODE FILE,OUTPUT=3D,FREQUENCY=5
U
***EL PRINT,ELSET=EALL
***S
*EL FILE,FREQUENCY=5
S,NOE
**oÍpÌß_Zbg
*NSET,NSET=NodeBC_Group_4
**oÍwè@RFÍ½Í@ZbgÉ¡ß_ª éêÉÍTOTALSÅv
*NODE PRINT, NSET=NodeBC_Group_4, TOTALS=ONLY,FREQUENCY=5
u
**oÍpÌß_Zbg
*NSET,NSET=NodeBC_Group_5
**oÍwè@RFÍ½Í@ZbgÉ¡ß_ª éêÉÍTOTALSÅv
*NODE PRINT, NSET=NodeBC_Group_5, TOTALS=ONLY,FREQUENCY=5
RF
*END STEP