*INCLUDE,INPUT=elem_node.inp
** ¨«lÌè`
*MATERIAL, NAME=SolidMaterial
*ELASTIC
210000, 0.300
**\bh
*SOLID SECTION,ELSET=EvolumesC3D10,MATERIAL=SolidMaterial
*MPC
PLANE,2,7,240,173,47,46,10,40,16
** ¡WuÝèiÃðÍj
*STEP,NLGEOM
*STATIC,direct
0.1,1
**ß_Ôwè
*BOUNDARY
NodeBC_Group_1,1,3
NodeBC_Group_2,1,3
240,1,3
*BOUNDARY
NodeBC_Group_3,3,3,-1
** ¡oÍwè
*NODE FILE, OUTPUT=3d
 U
 *EL FILE
 S, E
*END STEP