*INCLUDE,INPUT=B022_tire.inp
*INCLUDE,INPUT=B022_Trod.inp
*INCLUDE,INPUT=B022_shaft.inp
*Node, NSET=cNode
*ELSET, ELSET=Eall1
EvolumesC3D10
EvolumesC3D10_2
EvolumesC3D10_3
** ■物性値の定義
*MATERIAL, NAME=SolidMaterial
*ELASTIC
210000, 0.300
*SOLID SECTION,ELSET=Eall1,MATERIAL=SolidMaterial
*RIGID BODY,ELSET=EvolumesC3D10_2,REF NODE=41000,ROT NODE=41001
*RIGID BODY,ELSET=EvolumesC3D10_3,REF NODE=42000,ROT NODE=42001
*CONTACT PAIR, INTERACTION=INTFemConstraintContact,TYPE=SURFACE TO SURFACE
face2,face4
*SURFACE INTERACTION, NAME=INTFemConstraintContact
*SURFACE BEHAVIOR,PRESSURE-OVERCLOSURE=LINEAR
 1000000.0
 *FRICTION
0.1,5000.
*CONTACT PAIR, INTERACTION=INTFemConstraintContact,TYPE=SURFACE TO SURFACE
face3,face4
*SURFACE INTERACTION, NAME=INTFemConstraintContact
*SURFACE BEHAVIOR,PRESSURE-OVERCLOSURE=LINEAR
 1000000.0
 *FRICTION
0.1,5000.
*BOUNDARY
41000,1,1
41000,2,2
41000,3,3
41001,1,1,
41001,2,2,
41001,3,3,
**42000,1,1
42000,2,2,100.0
42000,3,3
**NodeBC_fix,1,3
*STEP, NLGEOM
*STATIC, SOLVER=SPOOLES,direct
0.05,1.0
** ■出力指定
*NODE FILE, OUTPUT=3d
 U
*EL FILE
 S, E
*END STEP