*****element file
*INCLUDE,INPUT = B014_Mesh_1_cylin_Re.inp
*INCLUDE,INPUT = B014_Mesh_2_plug_Re.inp
*****group set
*ELSET, ELSET=elCap
EfacesS4R
EfacesS3
***** tube material
*MATERIAL, NAME=MaterialSolid
*ELASTIC
210000, 0.300
***** plug material
*MATERIAL, NAME=MaterialSolid2
*ELASTIC
2500, 0.300
*****
*SOLID SECTION,ELSET=EfacesS4R_cylin,MATERIAL=MaterialSolid
1.57d0
*SOLID SECTION,ELSET=elCap,MATERIAL=MaterialSolid2
1.57d0
*****
*CONTACT PAIR, INTERACTION=INTFemConstraintContact,TYPE=SURFACE TO SURFACE
 DEP,IND
 *SURFACE INTERACTION, NAME=INTFemConstraintContact
 *SURFACE BEHAVIOR,PRESSURE-OVERCLOSURE=LINEAR
 1000000.0
*FRICTION
0.1,5000.
*STEP, NLGEOM
*STATIC, SOLVER=SPOOLES,direct
0.1,1.0
*BOUNDARY
NodeBC_Group_2_fix,2
*BOUNDARY
NodeBC_Group_2,2,2,-12.1
*NODE FILE, OUTPUT=2d
U
*EL FILE
S, E
*NODE PRINT, NSET=NodeBC_Group_2_fix, TOTALS=ONLY
 RF
*END STEP