** written by FreeCAD inp file writer for CalculiX,Abaqus meshes
** highest dimension mesh elements only.
** Nodes
*Node, NSET=Nall
** Volume elements
*Element, TYPE=C3D10, ELSET=Evolumes
** Define element set Eall
*ELSET, ELSET=Eall
Evolumes
***********************************************************
** Element sets for materials and FEM element type (solid, shell, beam, fluid)
*ELSET,ELSET=MaterialSolidSolid
Evolumes
***********************************************************
** constraints fixed node sets
** ConstraintFixed
*NSET,NSET=ConstraintFixed
***********************************************************
** constraints temperature node sets
** ConstraintTemperature
*NSET,NSET=ConstraintTemperature
***********************************************************
** Materials
** see information about units at file end
** FreeCAD material name: CalculiX-Steel
** MaterialSolid
*MATERIAL, NAME=MaterialSolid
*CONDUCTIVITY
43
***********************************************************
** Initial temperature constraint
*INITIAL CONDITIONS,TYPE=TEMPERATURE
** ConstraintInitialTemperature
Nall,300
***********************************************************
** Sections
*SOLID SECTION, ELSET=MaterialSolidSolid, MATERIAL=MaterialSolid
***********************************************************
** At least one step is needed to run an CalculiX analysis of FreeCAD
*STEP, INC=2000
*HEAT TRANSFER, STEADY STATE
**1.0,1.0
***********************************************************
** Fixed Constraints
** ConstraintFixed
*BOUNDARY
ConstraintFixed,1
ConstraintFixed,2
ConstraintFixed,3
***********************************************************
** Fixed temperature constraint applied
** ConstraintTemperature
*BOUNDARY
ConstraintTemperature,11,11,500
***********************************************************
** constraints heatflux element face heatflux
** ConstraintHeatflux
*FILM
** Heat flux on face Pad:Face2
32,F1,300,10
33,F1,300,10
***********************************************************
** Outputs --> frd file
*NODE FILE
U, NT
*EL FILE
S, E
** outputs --> dat file
** reaction forces for Constraint fixed
*NSET,NSET=tempNode
*NODE PRINT,NSET=tempNode
NT
***********************************************************
*END STEP