**vfAß_t@C
*INCLUDE,INPUT=A440_node_elem.inp
***********************************************************
** Materials
*MATERIAL, NAME=MaterialSolid
*ELASTIC
210000, 0.300
*DENSITY
1.000e-09
***********************************************************
**\bh
*SOLID SECTION,ELSET=EvolumesC3D10,MATERIAL=MaterialSolid
*AMPLITUDE,NAME=Graph1
0,1,
1.0,1,
***********************************************************
** At least one step is needed to run an CalculiX analysis of FreeCAD
** written by write_step_begin function
*STEP,NLGEOM
*DYNAMIC,direct
0.1,1.0
***********************************************************
***********************************************************
** Node loads Constraints
*CLOAD,AMPLITUDE=graph1
NodeBC_Group_1,1,250
***********************************************************
** Outputs --> frd file
** written by write_outputs_types function
*NODE FILE, OUTPUT=3d
U,RF
*EL FILE
S, E
***********************************************************
** written by write_step_end function
*END STEP