**vfðè`µÄ ét@CðÇÝÝÜ·B
*INCLUDE,INPUT=gear.inp
*INCLUDE,INPUT=rack.inp
*INCLUDE,INPUT=rotateX.inp
*INCLUDE,INPUT=rotateY.inp
**·×ÄÌvfðZbgEallÉo^µÜ·B
** Define element set Eall
*ELSET, ELSET=Eall
EvolumesC3D10
EvolumesC3D10_2
**·×ÄÌvfðZbgMaterialSolidSolidÉo^µÜ·B
*ELSET,ELSET=MaterialSolidSolid
EvolumesC3D10
EvolumesC3D10_2
**·×ÄÌß_ðZbgNallÉo^µÜ·B
*NSET,NSET=Nall
Nall_1
Nall_2
** MaterialSolid (mm ton)
*MATERIAL, NAME=MaterialSolid
*ELASTIC
210000, 0.300
*SOLID SECTION, ELSET=Eall, MATERIAL=MaterialSolid
*CONTACT PAIR, INTERACTION=INT1,TYPE=SURFACE TO SURFACE
DEP,IND
*SURFACE INTERACTION, NAME=INT1
*SURFACE BEHAVIOR,PRESSURE-OVERCLOSURE=LINEAR
1000000.0
***FRICTION
**0.0,5000.
*equation
*STEP,NLGEOM
*STATIC, SOLVER=SPOOLES,direct
0.1,5
*BOUNDARY
NodeBC_worm_low_Y,1,1
NodeBC_worm_low_Y,3,3
*BOUNDARY
NodeBC_fix_gear,1,3
*BOUNDARY
NodeBC_Z_gear,3,3
*BOUNDARY
NodeBC_fix_side,3,3
*BOUNDARY,AMPLITUDE=Graph_RX
292,1,1,1
*BOUNDARY,AMPLITUDE=Graph_RY
292,2,2,1
*NODE FILE
U
*EL FILE
S, E
***NODE FILE
***NT
*NODE PRINT, NSET=NodeBC_fix_gear
 RF
*NSET,NSET=fix_gear2
*NODE PRINT, NSET=fix_gear2
 RF
*NODE PRINT, NSET=NodeBC_worm_low_Y, TOTALS=ONLY
 RF
*END STEP