*INCLUDE,INPUT = Mesh_3_OUT.inp
***********************************************************
** Materials
** written by write_materials function
** Young's modulus unit is MPa = N/mm2
** FreeCAD material name: CalculiX-Steel
** SolidMaterial
*MATERIAL, NAME=SolidMaterial
*ELASTIC
210000, 0.300
***********************************************************
** Sections
** written by write_femelementsets function
**ビーム(縦横サイズ、Vベクトル）
***BEAM SECTION, ELSET=EbeamB32R, MATERIAL=SolidMaterial, SECTION=RECT
** 10 , 10
** 0.0, 1.0, 0
**
****シェル（板厚）（*解除のこと）
***SHELL SECTION, ELSET=EfacesS6, MATERIAL=SolidMaterial
**10.0
**ソリッド（*解除のこと）
*SOLID SECTION,ELSET=C3D10,MATERIAL=SolidMaterial
***********************************************************
** At least one step is needed to run an CalculiX analysis of FreeCAD
** written by write_step_begin function
*STEP
**BUCKLE
**3
*STATIC
***********************************************************
** Displacement constraint applied
** written by write_constraints_displacement function
** FemConstraintDisplacement
*BOUNDARY
Group_3,1
Group_3,2
Group_3,3
Group_3,5
Group_3,4
Group_3,6
**NodeBC_Group_2,2,2,-5
***********************************************************
** Node loads Constraints
** written by write_constraints_force function
*CLOAD
** FemConstraintForce
** node load on shape: Edge:Vertex1
Group_4,2,-0.2645503
***********************************************************
** Outputs --> frd file
** written by write_outputs_types function
*NODE FILE, OUTPUT=2d
U
*EL FILE
S, E
**出力指定　RFは反力　セットに複数節点がある場合にはTOTALSで合計
*NODE PRINT, NSET=Group_3, TOTALS=ONLY
 RF
***********************************************************
** written by write_step_end function
*END STEP