** written by FreeCAD inp file writer for CalculiX,Abaqus meshes
** highest dimension mesh elements only.
** Nodes
*Node, NSET=Nall
** Volume elements
*Element, TYPE=C3D10, ELSET=Evolumes
** Define element set Eall
*ELSET, ELSET=Eall
Evolumes
***********************************************************
** Element sets for materials and FEM element type (solid, shell, beam, fluid)
** written by write_element_sets_material_and_femelement_type function
*ELSET,ELSET=SolidMaterial003Solid
Evolumes
***********************************************************
** Node sets for fixed constraint
** written by write_node_sets_constraints_fixed function
** FemConstraintFixed002
*NSET,NSET=FemConstraintFixed002
***********************************************************
** Node sets for prescribed displacement constraint
** written by write_node_sets_constraints_displacement function
** FemConstraintDisplacement
*NSET,NSET=FemConstraintDisplacement
***********************************************************
** Surfaces for contact constraint
** written by write_surfaces_contraints_contact function
** FemConstraintContact
*SURFACE, NAME =DEP1
266,S4
272,S3
274,S3
278,S4
280,S4
283,S3
285,S3
291,S4
*SURFACE, NAME =IND1
195,S2
198,S3
200,S4
203,S3
206,S2
209,S4
210,S1
214,S2
215,S3
216,S4
218,S1
225,S2
227,S2
233,S4
234,S3
235,S2
236,S2
239,S2
246,S4
248,S2
** ... 5 like lines cut
***********************************************************
** Materials
** written by write_materials function
** Young's modulus unit is MPa = N/mm2
** FreeCAD material name: CalculiX-Steel
** SolidMaterial003
*MATERIAL, NAME=SolidMaterial003
*ELASTIC
210000, 0.300
***********************************************************
** Sections
** written by write_femelementsets function
*SOLID SECTION, ELSET=SolidMaterial003Solid, MATERIAL=SolidMaterial003
***********************************************************
** Contact Constraints
** written by write_constraints_contact function
** FemConstraintContact
*CONTACT PAIR, INTERACTION=INT1,TYPE=SURFACE TO SURFACE
DEP1,IND1
*SURFACE INTERACTION, NAME=INT1
*SURFACE BEHAVIOR,PRESSURE-OVERCLOSURE=LINEAR
1000000.0
*AMPLITUDE,NAME=Graph1
0,0,
1,1,
2,1,
*AMPLITUDE,NAME=Graph2
0,0,
1,0,
2,1,
***********************************************************
** At least one step is needed to run an CalculiX analysis of FreeCAD
** written by write_step_begin function
*STEP,NLGEOM,
*STATIC,direct
0.1,2
***********************************************************
** Fixed Constraints
** written by write_constraints_fixed function
** FemConstraintFixed002
*BOUNDARY
FemConstraintFixed002,1
FemConstraintFixed002,2
FemConstraintFixed002,3
***********************************************************
** Displacement constraint applied
** written by write_constraints_displacement function
** FemConstraintDisplacement
*BOUNDARY,AMPLITUDE=graph1
**FemConstraintDisplacement,1
FemConstraintDisplacement,2
FemConstraintDisplacement,3,3,-6.9
*BOUNDARY,AMPLITUDE=graph2
FemConstraintDisplacement,1,1,-20
***********************************************************
** Outputs --> frd file
** written by write_outputs_types function
*NODE FILE
U
*EL FILE
S, E
***********************************************************
** written by write_step_end function
*END STEP
***********************************************************
** CalculiX Input file
** written by write_footer function
**   written by    --> FreeCAD 0.18.4 (GitTag)
**   written on    --> Tue Jun 30 10:58:11 2020
**   file name     --> beam_solid_cont.FCStd
**   analysis name --> Analysis002
**
**
**
**   Units
**
**   Geometry (mesh data)        --> mm
**   Materials (Young's modulus) --> N/mm2 = MPa
**   Loads (nodal loads)         --> N
**