**最小の必要な項目をまとめています。項目ごとに設定を作成していきます。
**//////////////t911出力可////////////////////////
*INCLUDE,INPUT=Mesh_3_OUT_all.inp
**////////////////////////////////////////////
** ■物性値の定義
*MATERIAL, NAME=SolidMaterial
*ELASTIC
21000, 0.490
** ■要素プロパティ　（ELSET等は定義名入力）
**ソリッド（*解除のこと）
*SOLID SECTION,ELSET=EvolumesC3D20R,MATERIAL=SolidMaterial
*SOLID SECTION,ELSET=EvolumesC3D15R,MATERIAL=SolidMaterial
**NODE TO SURFACE or SURFACE TO SURFACE
**option:SMALL SLIDING or LARGE SLIDING
**option: ADJUST
*CONTACT PAIR, INTERACTION=INTFemConstraintContact,TYPE=SURFACE TO SURFACE
 Group_4,Group_5
Group_5,Group_6
Group_6,Group_7
Group_7,Group_8
Group_8,Group_9
Group_9,Group_10
Group_10,Group_11
Group_11,Group_12
Group_12,Group_13
Group_13,Group_14
Group_14,Group_15
 *SURFACE INTERACTION, NAME=INTFemConstraintContact
 *SURFACE BEHAVIOR,PRESSURE-OVERCLOSURE=LINEAR
 1000000.0
** ■ジョブ設定（静解析）
*STEP
*STATIC
** ■境界条件
*BOUNDARY
NodeBC_Group_1,1,3
NodeBC_Group_2,2,2,-30
NodeBC_Group_2,1,1,-30
NodeBC_Group_3,3,3
**境界条件　負荷
**CLOAD
*****1,4,1.0000000000000E+06
** ■出力指定
*NODE FILE, OUTPUT=3d
 U
 *EL FILE
 S, E
*NODE PRINT, NSET=NodeBC_Group_1, TOTALS=ONLY
RF
*NODE PRINT, NSET=NodeBC_Group_3, TOTALS=ONLY
RF
*END STEP